{"text_format":"1","workbook":"xlsx","n_sheets":40,"sheets":["TOP","TOP2X","1_1職務(役割)評価表の確認","1_2職務(役割)の試行","step1結果非表示","1_3職務(役割)の試行","1_1社員一覧の作成","master","1_2職務（役割）評価","1_3職務（役割）評価結果の確認","職務評価一覧","2_1社員一覧の作成","グラフ用","グラフ用2X","2_2職務(役割)評価表の確認","temp","2_3職務（役割）評価","職務評価一覧2","2_4活用係数の設定","2_6均等・均衡待遇のチェック","2_1X社員一覧の作成","temp2X","職務評価一覧2X","2_2X職務(役割)評価表の確認","2_3X職務（役割）評価","2_4X活用係数の設定","2_5時間賃率の計算","2_5X社員一覧の作成","2_6X均等・均衡待遇のチェック","3_1パート社員の格付け制度設計","3_2正社員との対応関係","3_3職務（役割）評価表","3_4職務（役割）評価","3_5活用係数の設定","3_6時間賃率の計算","格付け評価結果一覧","temp3","3_6職務(役割)評価を用いた 格付け(役割等級)制度の検証","3の結果ｼｰﾄ(隠し)","【参考】職務（役割）評価項目"],"not_rendered":{"charts":7,"images":4,"macros":1,"external_links":0,"defined_names":110,"comments":4,"pivot_tables":0},"unopened":[],"bounds":{"document_bytes":16777216,"sheet_cells":100000,"rows_first":2000,"rows_last":500,"rows_between":2000,"halvings":0,"cell_chars":16384,"cell_head_chars":4096},"cells_cut":0,"cells_raw":0,"read":"whole","date_system":"1900"}

{"sheet":"TOP","index":0,"n_rows":1,"n_cols":1,"rows_kept":1,"cut":false,"hidden":false,"merged":[]}
["職務(役割)評価ツール"]

{"sheet":"TOP2X","index":1,"n_rows":1,"n_cols":1,"rows_kept":1,"cut":false,"hidden":false,"merged":[]}
["職務(役割)評価ツール"]

{"sheet":"1_1職務(役割)評価表の確認","index":2,"n_rows":20,"n_cols":10,"rows_kept":20,"cut":false,"hidden":false,"merged":[]}
["職務(役割)評価ツール",null,null,null,"―　Step1　―"]
[null,"職務（役割）評価をやってみましょう！"]
[]
[]
[]
[]
[]
[]
[]
[]
[]
[]
[null,"Step1-① 職務(役割)評価表の確認"]
[null,"評価項目","①人材代替性","②革新性","③専門性","④裁量性","⑤対人関係の複雑さ\n（部門外／社外）","⑥対人関係の複雑さ\n（部門内）","⑦問題解決の困難度","⑧経営への影響度"]
[null,"　　　定義\n\n\nスケール","採用や配置転換によって代わりの人材を探すのが難しい仕事","現在の方法とは全く異なる新しい方法が求められる仕事","仕事を進める上で特殊なｽｷﾙや技能が必要な仕事","従業員の裁量に任せる仕事","仕事を行う上で、社外の取引先や顧客、部門外との調整が多い仕事","仕事を進める上で部門内の人材との調整が多い仕事","職務に関する課題を調査・抽出し、解決につなげる仕事","会社全体への業績に大きく影響する仕事"]
{"$rows_left_out":6}
{"sheet":"1_2職務(役割)の試行","index":3,"n_rows":46,"n_cols":18,"rows_kept":46,"cut":false,"hidden":false,"merged":[[33,6,35,6],[33,3,35,3],[42,1,44,1],[42,2,44,2],[39,1,41,1],[39,2,41,2],[42,6,44,6],[42,3,44,3],[36,6,38,6],[36,3,38,3],[39,6,41,6],[39,3,41,3],[36,2,38,2],[33,1,35,1],[33,2,35,2],[19,4,20,6],[19,1,20,1],[19,3,20,3],[19,2,20,2],[30,6,32,6],[30,3,32,3],[27,2,29,2],[27,6,29,6],[21,2,23,2],[21,1,23,1],[24,3,26,3],[27,3,29,3],[24,2,26,2],[27,1,29,1],[24,6,26,6],[21,6,23,6],[21,3,23,3],[30,1,32,1],[30,2,32,2],[36,1,38,1],[24,1,26,1],[27,7,29,7],[42,7,44,7],[30,7,32,7],[33,7,35,7],[36,7,38,7],[39,7,41,7],[19,7,20,7],[21,7,23,7],[24,7,26,7],[19,9,20,11],[19,12,20,12],[21,11,23,11],[21,12,23,12],[24,12,26,12],[33,11,35,11],[33,12,35,12],[27,11,29,11],[30,16,32,16],[27,12,29,12],[33,16,35,16],[24,17,26,17],[30,11,32,11],[30,12,32,12],[24,16,26,16],[24,11,26,11],[27,17,29,17],[42,11,44,11],[42,12,44,12],[36,11,38,11],[36,12,38,12],[39,11,41,11],[39,12,41,12],[42,16,44,16],[42,17,44,17],[39,16,41,16],[39,17,41,17],[18,4,18,7],[18,9,18,12],[18,14,18,17],[36,16,38,16],[36,17,38,17],[19,14,20,16],[19,17,20,17],[21,16,23,16],[21,17,23,17],[30,17,32,17],[33,17,35,17],[27,16,29,16]]}
["職務(役割)評価ツール",null,null,null,"―　Step1　―"]
[null,"職務(役割)評価をやってみましょう！"]
[]
[]
[]
[]
[]
[]
[]
[]
[]
[]
[]
[]
[]
{"$rows_left_out":32}
{"sheet":"step1結果非表示","index":4,"n_rows":18,"n_cols":5,"rows_kept":18,"cut":false,"hidden":true,"merged":[]}
[{"$f":"IF('1_2職務(役割)の試行'!F17=\"\",0,IF('1_2職務(役割)の試行'!F17=$E$1,1,2))","v":0},{"$f":"'1_2職務(役割)の試行'!H46","v":0},{"$f":"IF('1_2職務(役割)の試行'!F18=\"\",\"\",'1_2職務(役割)の試行'!F18)","v":""},null,"パートタイム労働者"]
[{"$f":"IF('1_2職務(役割)の試行'!K17=\"\",0,IF('1_2職務(役割)の試行'!K17=$E$1,1,2))","v":0},{"$f":"'1_2職務(役割)の試行'!M46","v":0},{"$f":"IF('1_2職務(役割)の試行'!K18=\"\",\"\",'1_2職務(役割)の試行'!K18)","v":""}]
[{"$f":"IF('1_2職務(役割)の試行'!P17=\"\",0,IF('1_2職務(役割)の試行'!P17=$E$1,1,2))","v":0},{"$f":"'1_2職務(役割)の試行'!R46","v":0},{"$f":"IF('1_2職務(役割)の試行'!P18=\"\",\"\",'1_2職務(役割)の試行'!P18)","v":""}]
[]
[]
[]
[]
[]
[]
[null,{"$f":"IF('1_2職務(役割)の試行'!F18=\"\",\"\",'1_2職務(役割)の試行'!F18)","v":""},{"$f":"IF('1_2職務(役割)の試行'!K18=\"\",\"\",'1_2職務(役割)の試行'!K18)","v":""},{"$f":"IF('1_2職務(役割)の試行'!P18=\"\",\"\",'1_2職務(役割)の試行'!P18)","v":""}]
["①人材代替性",{"$f":"INDIRECT(\"'1_2職務(役割)の試行'!H\"&22+3*(ROW()-11))","v":0},{"$f":"INDIRECT(\"'1_2職務(役割)の試行'!M\"&22+3*(ROW()-11))","v":0},{"$f":"INDIRECT(\"'1_2職務(役割)の試行'!R\"&22+3*(ROW()-11))","v":0}]
["②革新性",{"$f":"INDIRECT(\"'1_2職務(役割)の試行'!H\"&22+3*(ROW()-11))","v":0},{"$f":"INDIRECT(\"'1_2職務(役割)の試行'!M\"&22+3*(ROW()-11))","v":0},{"$f":"INDIRECT(\"'1_2職務(役割)の試行'!R\"&22+3*(ROW()-11))","v":0}]
["③専門性",0,0,0]
["④裁量性",0,0,0]
["⑤対人関係の複雑さ\n（部門外／社外）",0,0,0]
{"$rows_left_out":4}
{"sheet":"1_3職務(役割)の試行","index":5,"n_rows":15,"n_cols":4,"rows_kept":15,"cut":false,"hidden":false,"merged":[]}
["職務(役割)評価ツール",null,null,"―　Step1　―"]
[null,"職務(役割)評価をやってみましょう！"]
[]
[]
[]
[]
[]
[]
[]
[]
[]
[]
[]
[]
[null,"Step1-③ 評価結果の視覚化"]
{"$rows_left_out":1}
{"sheet":"1_1社員一覧の作成","index":6,"n_rows":56,"n_cols":6,"rows_kept":56,"cut":false,"hidden":true,"merged":[]}
["職務（役割）評価ツール",null,null,null,"―　Step1　―"]
["　　　職務（役割）評価をやってみましょう！"]
[]
[]
[]
[]
[]
[]
[]
[]
[]
[]
[]
[]
[null,"① 社員一覧の作成"]
{"$rows_left_out":42}
{"sheet":"master","index":7,"n_rows":13,"n_cols":27,"rows_kept":13,"cut":false,"hidden":true,"merged":[]}
["雇用区分",null,null,"評価項目","①人材代替性","②革新性","③専門性","④裁量性","⑤対人関係の複雑さ\n（部門外／社外）","⑥対人関係の複雑さ\n（部門内）","⑦問題解決の困難度","⑧経営への影響度",null,null,null,null,"格付け",null,null,"パート格付けチェック","正社員各付けチェック",null,"パートタイム労働者","正社員",null,"パート件数","正社員件数"]
["正社員",null,null,"　　定義\n\n\nスケール","採用や配置転換によって代わりの人材を探すのが難しい仕事","現在の方法とは全く異なる新しい方法が求められる仕事","仕事を進める上で特殊なｽｷﾙや技能が必要な仕事","従業員の裁量に任せる仕事","仕事を行う上で、社外の取引先や顧客、部門外との調整が多い仕事","仕事を進める上で部門内の人材との調整が多い仕事","職務に関する課題を調査・抽出し、解決につなげる仕事","会社全体への業績に大きく影響する仕事",null,null,null,null,"パート⑤",null,null,{"$f":"COUNTIF(パートタイム労働者,\"パート222\")","v":{"$error":"#REF!"}},{"$f":"COUNTIF(正社員,\"社員2222\")","v":{"$error":"#REF!"}},null,{"$f":"INDEX(パートタイム労働者,1,1)","v":{"$error":"#REF!"}},{"$f":"INDEX(正社員,1,1)","v":{"$error":"#REF!"}},null,{"$f":"COUNTA(パートタイム労働者)","v":1},{"$f":"COUNTA(正社員)","v":1}]
["パートタイム労働者",null,null,1,"採用や配置転換による代替人材の確保が非常に容易な仕事","現在の手法をそのまま活用出来る仕事","それほど専門性が必要とされない仕事","原則として自由裁量のない仕事","部門外・社外との交渉・折衝業務がない仕事","部門内との調整作業がない仕事","既存の方法で解決出来ることが多い仕事","経営への影響度が非常に軽微な仕事",null,null,null,null,"パート④"]
[null,null,null,2,"採用や配置転換による代替人材の確保が容易な仕事","現在の手法をかなりそのまま活用出来る仕事","担当分野において平均的な専門性が必要とされる仕事","自由裁量を行使した結果が、本人のみに影響を与える仕事","部門外・社外との交渉・折衝業務が少ない仕事","部門内との調整作業が少ない仕事","既存の方法を少しｱﾚﾝｼﾞすることで解決出来ることが多い仕事","経営への影響度が軽微な仕事",null,null,null,null,"パート③"]
[null,null,null,3,"採用や配置転換による代替人材の確保が難しい仕事","現在の手法をある程度活用出来る仕事","担当分野において高い専門性が必要とされる仕事","自由裁量を行使した結果が、当該部門の一部に影響を与える仕事","部門外・社外との交渉・折衝業務がやや多い仕事","部門内との調整作業がやや多い仕事","既存の方法を大きくｱﾚﾝｼﾞすることで解決出来ることが多い仕事","経営への影響度がやや大きな仕事",null,null,null,null,"パート②"]
[null,null,null,4,"採用や配置転換による代替人材の確保が非常に難しい仕事","現在の手法を参考程度にしながら、異なるものが求められる仕事","担当分野において高い専門性が必要とされ、かつその周辺分野においても平均的な専門性が必要とされる仕事","自由裁量を行使した結果が、当該部門全体に影響を与える仕事","部門外・社外との交渉・折衝業務が多い仕事","部門内との調整作業が多い仕事","既存の方法を参考にしつつも、新しい方法を用いなければ解決出来ないことが多い仕事","経営への影響度が大きな仕事",null,null,null,null,"パート①"]
[null,null,null,5,"採用や配置転換による代替人材の確保が不可能な仕事","現在の手法と全く異なるものが求められる仕事","担当分野において高い専門性が必要とされ、かつその周辺分野においても高い専門性が必要とされる仕事","自由裁量を行使した結果が、企業全体に影響を与える仕事","部門外・社外との交渉・折衝業務が非常に多い仕事","部門内との調整作業が非常に多い仕事","最初から新しい方法を用いなければ解決出来ない仕事","経営への影響度が非常に大きな仕事",null,null,null,null,"7等級（部長相当）"]
[null,null,null,null,null,null,null,null,null,null,null,null,null,null,null,null,"6等級（課長相当）"]
[null,null,null,null,null,null,null,null,null,null,null,null,null,null,null,null,"5等級"]
[null,null,null,null,null,null,null,null,null,null,null,null,null,null,null,null,"4等級"]
[null,null,null,null,null,null,null,null,null,null,null,null,null,null,null,null,"3等級"]
[null,null,null,null,null,null,null,null,null,null,null,null,null,null,null,null,"2等級"]
[null,null,null,null,null,null,null,null,null,null,null,null,null,null,null,null,"1等級"]

{"sheet":"1_2職務（役割）評価","index":8,"n_rows":31,"n_cols":7,"rows_kept":31,"cut":false,"hidden":true,"merged":[[21,6,22,6],[21,2,22,2],[21,3,22,3],[21,1,22,1],[21,4,22,5]]}
["職務（役割）評価ツール",null,null,"―　Step1　―"]
["　　　職務（役割）評価をやってみましょう！"]
[]
[]
[]
[]
[]
[]
[]
[]
[]
[]
[]
[]
[]
{"$rows_left_out":17}
{"sheet":"1_3職務（役割）評価結果の確認","index":9,"n_rows":56,"n_cols":6,"rows_kept":56,"cut":false,"hidden":true,"merged":[]}
["職務（役割）評価ツール",null,null,null,"―　Step1　―"]
["　　　職務（役割）評価をやってみましょう！"]
[]
[]
[]
[]
[]
[]
[]
[]
[]
[]
[]
[]
[null,"③ 職務（役割）評価結果の確認"]
{"$rows_left_out":42}
{"sheet":"職務評価一覧","index":10,"n_rows":41,"n_cols":11,"rows_kept":41,"cut":false,"hidden":true,"merged":[]}
["社員No","雇用区分","スケール",{"$f":"IF(ISERROR(MATCH('1_2職務（役割）評価'!$C$19,評価結果一覧,0)),COUNTA(評価結果一覧)+1,MATCH('1_2職務（役割）評価'!$C$19,評価結果一覧,0))","v":9},null,108,{"$f":"IF(ISERROR(MATCH(F1,評価結果一覧,0)),0,MATCH(F1,評価結果一覧,0))","v":9}]
[101,"正社員",2,3,3,3,3,2,2,2,32]
[102,"パートタイム労働者",5,3,5,5,4,3,4,4,33]
[103,"パートタイム労働者",10,10,5,5,4,3,4,4,45]
[104,"正社員"]
[105,"正社員"]
[106,"パートタイム労働者"]
[107,"正社員",1,1,2,2,2,3,3,3,30]
[108,"正社員"]
[109,"パートタイム労働者",3,3,3,2,4,3,3,3,37]
[110,"パートタイム労働者"]
[111,"正社員"]
[112,"パートタイム労働者"]
[113,"パートタイム労働者"]
[114,"正社員"]
{"$rows_left_out":27}
{"sheet":"2_1社員一覧の作成","index":11,"n_rows":964,"n_cols":6,"rows_kept":964,"cut":false,"hidden":false,"merged":[]}
["職務(役割)評価ツール",null,null,null,"―　Step2　―"]
[null,"均等・均衡待遇が図られているかチェックしてみましょう！"]
[]
[]
[]
[]
[]
[]
[]
[]
[]
[]
[]
[]
[]
{"$rows_left_out":950}
{"sheet":"グラフ用","index":12,"n_rows":10,"n_cols":12,"rows_kept":10,"cut":false,"hidden":true,"merged":[]}
[null,"正社員",null,null,"パートタイム労働者",null,null,"正社員",null,null,"パートタイム労働者"]
[]
[null,"職務（役割）ポイント","時間賃率",null,"職務（役割）ポイント","パート時間賃率",null,"格付け","ポイント",null,"格付け","ポイント"]
[null,null,null,null,null,null,null,"パート⑤",80,null,"7等級（部長相当）",40]
[null,null,null,null,null,null,null,"パート④",70,null,"6等級（課長相当）",25]
[null,null,null,null,null,null,null,"パート③",60,null,"5等級",37]
[null,null,null,null,null,null,null,"パート②",50,null,"4等級",26]
[null,null,null,null,null,null,null,"パート①",29,null,"3等級",37]
[null,null,null,null,null,null,null,null,null,null,"2等級",26]
[null,null,null,null,null,null,null,null,null,null,"1等級",26]

{"sheet":"グラフ用2X","index":13,"n_rows":3,"n_cols":6,"rows_kept":3,"cut":false,"hidden":true,"merged":[]}
[null,"正社員",null,null,"パートタイム労働者"]
[]
[null,"職務（役割）ポイント","時間賃率",null,"職務（役割）ポイント","パート時間賃率"]

{"sheet":"2_2職務(役割)評価表の確認","index":14,"n_rows":20,"n_cols":10,"rows_kept":20,"cut":false,"hidden":false,"merged":[]}
["職務(役割)評価ツール",null,null,null,"―　Step2　―"]
[null,"均等・均衡待遇が図られているかチェックしてみましょう！"]
[]
[]
[]
[]
[]
[]
[]
[]
[]
[]
[null,"Step2-② 職務(役割)評価表の確認"]
[null,"評価項目","①人材代替性","②革新性","③専門性","④裁量性","⑤対人関係の複雑さ\n（部門外／社外）","⑥対人関係の複雑さ\n（部門内）","⑦問題解決の困難度","⑧経営への影響度"]
[null,"　　定義\n\n\n\nスケール","採用や配置転換によって代わりの人材を探すのが難しい仕事","現在の方法とは全く異なる新しい方法が求められる仕事","仕事を進める上で特殊なｽｷﾙや技能が必要な仕事","従業員の裁量に任せる仕事","仕事を行う上で、社外の取引先や顧客、部門外との調整が多い仕事","仕事を進める上で部門内の人材との調整が多い仕事","職務に関する課題を調査・抽出し、解決につなげる仕事","会社全体への業績に大きく影響する仕事"]
{"$rows_left_out":6}
{"sheet":"temp","index":15,"n_rows":33,"n_cols":7,"rows_kept":33,"cut":false,"hidden":true,"merged":[]}
[0,null,null,{"$f":"IF(ISERROR(MATCH(INDEX(社員一覧S2,$C$20,1)&$C$21,評価結果一覧2,0)),COUNTA(評価結果一覧2)+1,MATCH(INDEX(社員一覧S2,$C$20,1)&$C$21,評価結果一覧2,0))","v":18},null,null,{"$f":"IF(ISERROR(MATCH(F1,評価結果一覧2,0)),0,MATCH(F1,評価結果一覧2,0))","v":0}]
[1]
[]
[]
[]
[]
[]
[]
[]
[]
[]
[]
[]
[]
[]
{"$rows_left_out":19}
{"sheet":"2_3職務（役割）評価","index":16,"n_rows":33,"n_cols":8,"rows_kept":33,"cut":false,"hidden":false,"merged":[[23,6,24,6],[23,2,24,2],[23,3,24,3],[23,1,24,1],[23,4,24,5],[32,7,32,8],[23,7,24,8],[28,7,28,8],[29,7,29,8],[30,7,30,8],[31,7,31,8],[25,7,25,8],[26,7,26,8],[27,7,27,8]]}
["職務(役割)評価ツール",null,null,"―　Step2　―"]
[null,"均等・均衡待遇が図られているかチェックしてみましょう！"]
[]
[]
[]
[]
[]
[]
[]
[]
[]
[]
[]
[]
[]
{"$rows_left_out":19}
{"sheet":"職務評価一覧2","index":17,"n_rows":17,"n_cols":11,"rows_kept":17,"cut":false,"hidden":true,"merged":[]}
["社員No","雇用区分","ポイント合計",{"$f":"IF(ISERROR(MATCH(INDEX(社員一覧S2,'2_3職務（役割）評価'!$C$20,1)&'2_3職務（役割）評価'!$C$21,評価結果一覧2,0)),COUNTA(評価結果一覧2)+1,MATCH(INDEX(社員一覧S2,'2_3職務（役割）評価'!$C$20,1)&'2_3職務（役割）評価'!$C$21,評価結果一覧2,0))","v":18},null,"s-5正社員",{"$f":"IF(ISERROR(MATCH(F1,評価結果一覧2,0)),0,MATCH(F1,評価結果一覧2,0))","v":16}]
["p-1パートタイム労働者",null,8,1,1,1,1,1,1,1,1]
["p-2パートタイム労働者",null,16,2,2,2,2,2,2,2,2]
["p-3パートタイム労働者",null,19,3,3,3,2,2,2,2,2]
["p-4パートタイム労働者",null,32,4,4,4,4,4,4,4,4]
["s-1正社員",null,24,3,3,3,3,3,3,3,3]
["s-2正社員",null,28,3,3,3,3,4,4,4,4]
["s-3正社員",null,35,5,5,5,4,4,4,4,4]
["s-4正社員",null,40,5,5,5,5,5,5,5,5]
["p-5パートタイム労働者",null,16,2,2,2,2,2,2,2,2]
["p-6パートタイム労働者",null,16,2,2,2,2,2,2,2,2]
["p-7パートタイム労働者",null,16,2,2,2,2,2,2,2,2]
["p-8パートタイム労働者",null,16,2,2,2,2,2,2,2,2]
["p-9パートタイム労働者",null,16,2,2,2,2,2,2,2,2]
["p-10パートタイム労働者",null,16,2,2,2,2,2,2,2,2]
{"$rows_left_out":3}
{"sheet":"2_4活用係数の設定","index":18,"n_rows":19,"n_cols":4,"rows_kept":19,"cut":false,"hidden":false,"merged":[]}
["職務(役割)評価ツール",null,null,"―　Step2　―"]
[null,"均等・均衡待遇が図られているかチェックしてみましょう！"]
[]
[]
[]
[]
[]
[]
[]
[]
[]
[]
[]
[]
[]
{"$rows_left_out":5}
{"sheet":"2_6均等・均衡待遇のチェック","index":19,"n_rows":23,"n_cols":4,"rows_kept":23,"cut":false,"hidden":false,"merged":[]}
["職務(役割)評価ツール",null,null,"―　Step2　―"]
[null,"均等・均衡待遇が図られているかチェックしてみましょう！"]
[]
[]
[]
[]
[]
[]
[]
[]
[]
[]
[]
[]
[]
{"$rows_left_out":9}
{"sheet":"2_1X社員一覧の作成","index":20,"n_rows":21,"n_cols":6,"rows_kept":21,"cut":false,"hidden":false,"merged":[]}
["職務(役割)評価ツール",null,null,null,"―　Step2(ｵﾌﾟｼｮﾝ)　―"]
[null,"自社の実態に合わせてカスタマイズした職務（役割）評価表を用いて評価してみましょう！"]
[]
[]
[]
[]
[]
[]
[]
[]
[]
[]
[]
[]
[]
{"$rows_left_out":7}
{"sheet":"temp2X","index":21,"n_rows":19,"n_cols":7,"rows_kept":19,"cut":false,"hidden":true,"merged":[]}
[0,null,null,{"$f":"IF(ISERROR(MATCH(INDEX(社員一覧2X,$C$20,1)&$C$21,評価結果一覧2X,0)),COUNTA(評価結果一覧2X)+1,MATCH(INDEX(社員一覧2X,$C$20,1)&$C$21,評価結果一覧2X,0))","v":5},null,null,{"$f":"IF(ISERROR(MATCH(F1,評価結果一覧2X,0)),0,MATCH(F1,評価結果一覧2X,0))","v":0}]
[0]
[]
[]
[]
[]
[]
[]
[]
[]
[]
[]
[]
[]
[]
{"$rows_left_out":5}
{"sheet":"職務評価一覧2X","index":22,"n_rows":4,"n_cols":11,"rows_kept":4,"cut":false,"hidden":true,"merged":[]}
["社員No","雇用区分","ポイント合計",{"$f":"IF(ISERROR(MATCH(INDEX(社員一覧2X,'2_3X職務（役割）評価'!$C$20,1)&'2_3X職務（役割）評価'!$C$21,評価結果一覧2X,0)),COUNTA(評価結果一覧2X)+1,MATCH(INDEX(社員一覧2X,'2_3X職務（役割）評価'!$C$20,1)&'2_3X職務（役割）評価'!$C$21,評価結果一覧2X,0))","v":5},null,"Aパートタイム労働者",{"$f":"IF(ISERROR(MATCH(F1,評価結果一覧2X,0)),0,MATCH(F1,評価結果一覧2X,0))","v":3}]
["B正社員",null,15,1,2,1,2,3,1,2,3]
["Aパートタイム労働者",null,8,1,1,1,1,1,1,1,1]
["aaaaa正社員",null,24,3,3,3,3,3,3,3,3]

{"sheet":"2_2X職務(役割)評価表の確認","index":23,"n_rows":20,"n_cols":10,"rows_kept":20,"cut":false,"hidden":false,"merged":[]}
["職務(役割)評価ツール"]
[null,"自社の実態に合わせてカスタマイズした職務（役割）評価表を用いて評価してみましょう！"]
[]
[]
[]
[]
[]
[]
[]
[]
[]
[]
[null,"Step2(ｵﾌﾟｼｮﾝ)-② 職務(役割)評価表のカスタマイズ"]
[null,"評価項目","①人材代替性","②革新性","③専門性","④裁量性","⑤対人関係の複雑さ\n（部門外／社外）","⑥対人関係の複雑さ\n（部門内）","⑦問題解決の困難度","⑧経営への影響度"]
[null,"　　定義\n\n\nスケール","採用や配置転換によって代わりの人材を探すのが難しい仕事","現在の方法とは全く異なる新しい方法が求められる仕事","仕事を進める上で特殊なｽｷﾙや技能が必要な仕事","従業員の裁量に任せる仕事","仕事を行う上で、社外の取引先や顧客、部門外との調整が多い仕事","仕事を進める上で部門内の人材との調整が多い仕事","職務に関する課題を調査・抽出し、解決につなげる仕事","会社全体への業績に大きく影響する仕事"]
{"$rows_left_out":6}
{"sheet":"2_3X職務（役割）評価","index":24,"n_rows":33,"n_cols":8,"rows_kept":33,"cut":false,"hidden":false,"merged":[[29,7,29,8],[30,7,30,8],[31,7,31,8],[32,7,32,8],[25,7,25,8],[26,7,26,8],[27,7,27,8],[28,7,28,8],[23,7,24,8],[23,6,24,6],[23,2,24,2],[23,3,24,3],[23,1,24,1],[23,4,24,5]]}
["職務(役割)評価ツール",null,null,"―　Step2(ｵﾌﾟｼｮﾝ)　―"]
[null,"自社の実態に合わせてカスタマイズした職務（役割）評価表を用いて評価してみましょう！"]
[]
[]
[]
[]
[]
[]
[]
[]
[]
[]
[]
[]
[]
{"$rows_left_out":19}
{"sheet":"2_4X活用係数の設定","index":25,"n_rows":19,"n_cols":4,"rows_kept":19,"cut":false,"hidden":false,"merged":[]}
["職務(役割)評価ツール",null,null,"―　Step2(ｵﾌﾟｼｮﾝ)　―"]
[null,"自社の実態に合わせてカスタマイズした職務（役割）評価表を用いて評価してみましょう！"]
[]
[]
[]
[]
[]
[]
[]
[]
[]
[]
[]
[]
[]
{"$rows_left_out":5}
{"sheet":"2_5時間賃率の計算","index":26,"n_rows":57,"n_cols":29,"rows_kept":57,"cut":false,"hidden":true,"merged":[]}
["職務（役割）評価ツール",null,null,null,"―　Step2　―"]
["　　　均等・均衡待遇が図られているかチェックしてみましょう！"]
[]
[]
[]
[]
[null,null,null,null,null,null,null,null,null,null,null,null,null,null,null,null,null,null,null,null,null,null,null,null,null,null,null,null,"正社員"]
[]
[]
[]
[]
[]
[]
[]
[]
{"$rows_left_out":43}
{"sheet":"2_5X社員一覧の作成","index":27,"n_rows":953,"n_cols":6,"rows_kept":953,"cut":false,"hidden":false,"merged":[]}
["職務(役割)評価ツール",null,null,null,"―　Step2(ｵﾌﾟｼｮﾝ)　―"]
[null,"自社の実態に合わせてカスタマイズした職務（役割）評価表を用いて評価してみましょう！"]
[]
[]
[]
[]
[]
[]
[]
[]
[]
[]
[]
[]
[]
{"$rows_left_out":939}
{"sheet":"2_6X均等・均衡待遇のチェック","index":28,"n_rows":23,"n_cols":4,"rows_kept":23,"cut":false,"hidden":false,"merged":[]}
["職務(役割)評価ツール",null,null,"―　Step2(ｵﾌﾟｼｮﾝ)　―"]
[null,"自社の実態に合わせてカスタマイズした職務（役割）評価表を用いて評価してみましょう！"]
[]
[]
[]
[]
[]
[]
[]
[]
[]
[]
[]
[]
[]
{"$rows_left_out":9}
{"sheet":"3_1パート社員の格付け制度設計","index":29,"n_rows":22,"n_cols":27,"rows_kept":22,"cut":false,"hidden":false,"merged":[]}
["職務(役割)評価ツール",null,null,"―　Step3　―"]
[null,"職務(役割)評価結果を活用して均等・均衡待遇を実現できる制度を検討してみましょう！（応用編）"]
[]
[]
[]
[]
[]
[]
[]
[]
[]
[]
[]
[]
[]
{"$rows_left_out":8}
{"sheet":"3_2正社員との対応関係","index":30,"n_rows":23,"n_cols":4,"rows_kept":23,"cut":false,"hidden":false,"merged":[]}
["職務(役割)評価ツール",null,null,"―　Step3　―"]
[null,"職務(役割)評価結果を活用して均等・均衡待遇を実現できる制度を検討してみましょう！（応用編）"]
[]
[]
[]
[]
[]
[]
[]
[]
[]
[]
[]
[]
[null,"Step3-② 正社員の職能資格制度との対応関係の設定"]
{"$rows_left_out":9}
{"sheet":"3_3職務（役割）評価表","index":31,"n_rows":20,"n_cols":10,"rows_kept":20,"cut":false,"hidden":false,"merged":[]}
["職務(役割)評価ツール",null,null,null,"―　Step3　―","bit"]
[null,"職務(役割)評価結果を活用して均等・均衡待遇を実現できる制度を検討してみましょう！（応用編）"]
[]
[]
[]
[]
[]
[]
[]
[]
[]
[]
[null,"Step3-③ 職務(役割)評価表のカスタマイズ"]
[null,"評価項目","①人材代替性","②革新性","③専門性","④裁量性","⑤対人関係の複雑さ\n（部門外／社外）","⑥対人関係の複雑さ\n（部門内）","⑦問題解決の困難度","⑧経営への影響度"]
[null,"　　定義\n\n\nスケール","採用や配置転換によって代わりの人材を探すのが難しい仕事","現在の方法とは全く異なる新しい方法が求められる仕事","仕事を進める上で特殊なｽｷﾙや技能が必要な仕事","従業員の裁量に任せる仕事","仕事を行う上で、社外の取引先や顧客、部門外との調整が多い仕事","仕事を進める上で部門内の人材との調整が多い仕事","職務に関する課題を調査・抽出し、解決につなげる仕事","会社全体への業績に大きく影響する仕事"]
{"$rows_left_out":6}
{"sheet":"3_4職務（役割）評価","index":32,"n_rows":36,"n_cols":8,"rows_kept":36,"cut":false,"hidden":false,"merged":[[30,7,30,8],[26,6,27,6],[26,2,27,2],[26,3,27,3],[26,1,27,1],[26,4,27,5],[26,7,27,8],[28,7,28,8],[29,7,29,8],[35,7,35,8],[31,7,31,8],[32,7,32,8],[33,7,33,8],[34,7,34,8]]}
["職務(役割)評価ツール",null,null,"―　Step3　―"]
[null,"職務(役割)評価結果を活用して均等・均衡待遇を実現できる制度を検討してみましょう！（応用編）"]
[]
[]
[]
[]
[]
[]
[]
[]
[]
[]
[]
[]
[]
{"$rows_left_out":22}
{"sheet":"3_5活用係数の設定","index":33,"n_rows":20,"n_cols":4,"rows_kept":20,"cut":false,"hidden":true,"merged":[]}
["職務（役割）評価ツール",null,null,"―　Step3　―"]
["　　　職務（役割）評価結果を活用して均等・均衡待遇を実現できる制度を検討してみましょう！（応用編）―"]
[]
[]
[]
[]
[]
[]
[]
[]
[]
[]
[]
[]
[]
{"$rows_left_out":6}
{"sheet":"3_6時間賃率の計算","index":34,"n_rows":23,"n_cols":28,"rows_kept":23,"cut":false,"hidden":true,"merged":[]}
["職務（役割）評価ツール",null,null,"―　Step3　―"]
["　　　職務（役割）評価結果を活用して均等・均衡待遇を実現できる制度を検討してみましょう！（応用編）―"]
[]
[]
[]
[]
[]
[]
[]
[]
[]
[]
[]
[]
[null,"⑥ 時間賃率の計算",null,null,null,null,null,null,null,null,null,null,null,null,null,null,null,null,null,null,null,null,null,null,null,null,null,"パートタイム労働者"]
{"$rows_left_out":9}
{"sheet":"格付け評価結果一覧","index":35,"n_rows":1,"n_cols":9,"rows_kept":1,"cut":false,"hidden":true,"merged":[]}
["格付け","雇用区分","ポイント合計",{"$f":"IF(ISERROR(MATCH('3_4職務（役割）評価'!C24,格付け評価結果一覧,0)),COUNTA(格付け評価結果一覧)+1,MATCH('3_4職務（役割）評価'!C24,格付け評価結果一覧,0))","v":2},null,"パート222",{"$f":"IF(ISERROR(MATCH(F1,格付け評価結果一覧,0)),0,MATCH(F1,格付け評価結果一覧,0))","v":0},null,{"$f":"IF(ISERROR(MATCH('3_4職務（役割）評価'!C24,パートタイム労働者,0)),\"正社員\",\"パートタイム労働者\")","v":"正社員"}]

{"sheet":"temp3","index":36,"n_rows":36,"n_cols":7,"rows_kept":36,"cut":false,"hidden":true,"merged":[]}
[0,null,null,{"$f":"IF(ISERROR(MATCH(C24,格付け評価結果一覧,0)),COUNTA(格付け評価結果一覧)+1,MATCH(C24,格付け評価結果一覧,0))","v":2},null,null,{"$f":"IF(ISERROR(MATCH(F1,格付け評価結果一覧,0)),0,MATCH(F1,格付け評価結果一覧,0))","v":0}]
[1]
[]
[]
[]
[]
[]
[]
[]
[]
[]
[]
[]
[]
[]
{"$rows_left_out":22}
{"sheet":"3_6職務(役割)評価を用いた 格付け(役割等級)制度の検証","index":37,"n_rows":21,"n_cols":4,"rows_kept":21,"cut":false,"hidden":false,"merged":[]}
["職務(役割)評価ツール",null,null,"―　Step3　―"]
[null,"職務(役割)評価結果を活用して均等・均衡待遇を実現できる制度を検討してみましょう！（応用編）"]
[]
[]
[]
[]
[]
[]
[]
[]
[]
[]
[]
[]
[]
{"$rows_left_out":7}
{"sheet":"3の結果ｼｰﾄ(隠し)","index":38,"n_rows":16,"n_cols":15,"rows_kept":16,"cut":false,"hidden":true,"merged":[]}
["X軸","ポイント","格付け","対応格付け","等級","比較対象","対応系列",null,null,null,null,null,null,null,"ColorIndex"]
[null,null,null,null,null,null,null,null,null,null,null,1,"薄い青",null,41]
[null,null,null,null,null,null,null,null,null,null,null,2,"ペールブルー",null,37]
[null,null,null,null,null,null,null,null,null,null,null,3,"水色",null,8]
[null,null,null,null,null,null,null,null,null,null,null,4,"薄い水色",null,34]
[null,null,null,null,null,null,null,null,null,null,null,5,"薄い黄",null,36]
[null,null,null,null,null,null,null,null,null,null,null,6,"ベージュ",null,40]
[null,null,null,null,null,null,null,null,null,null,null,7,"ラベンダー",null,39]
[null,null,null,null,null,null,null,null,null,null,null,8,"薄い緑",null,35]
[null,null,null,null,null,null,null,null,null,null,null,9,"ライム",null,43]
[null,null,null,null,null,null,null,null,null,null,null,10,"黄",null,6]
[null,null,null,null,null,null,null,null,null,null,null,11,"ローズ",null,38]
[null,null,null,null,null,null,null,null,null,null,null,12,"明るい緑",null,4]
[null,null,null,null,null,null,null,null,null,null,null,13,"ゴールド",null,44]
[null,null,null,null,null,null,null,null,null,null,null,14,"ピンク",null,7]
{"$rows_left_out":2}
{"sheet":"【参考】職務（役割）評価項目","index":39,"n_rows":35,"n_cols":4,"rows_kept":35,"cut":false,"hidden":true,"merged":[[31,2,32,2],[4,1,5,1],[4,2,5,2],[4,3,5,3],[6,1,8,1],[9,1,11,1],[12,1,14,1],[15,1,16,1],[28,2,29,2]]}
["職務（役割）評価ツール",null,null,"【参考】職務（役割）評価項目（例）"]
["【参考】職務（役割）評価項目（例）"]
[]
[null,"国際労働機関（ILO）による職務（役割）評価項目"]
[null,"基本的な\n職務評価項目 ","二次的な\n職務評価項目","説明"]
[]
[null,"知識・技能　","職務知識","職務を遂行する上で必要な知識、専門的な知識・資格 "]
[null,null,"コミュニケーションの技能　","職務を遂行する上で必要な、顧客や利用者、職場の上司や同僚等と良好な関係を作るための、口頭または文書によるコミュニケーションの技能"]
[null,null,"身体的技能","職務を遂行する上で必要な、手先の器用さ、手わざの良さ・正確さ、機械や器具等を操作する技能"]
[null,"負担","感情的負担","職務を遂行するうえで、顧客等の感情に配慮し、自分の感情を調整したり、相手の感情の起伏を冷静に受け止め、自分の感情を抑制したりする際に生じる負担"]
[null,null,"心的負担","職務を遂行する上で要求される、集中力や注意力、同時進行で複数の仕事を行う、仕事の期限が厳しいなど、精神にかかる負担"]
[null,null,"身体的負担","重量物の運搬、無理な姿勢の維持など、職務を遂行する上で要求される身体にかかる負担"]
[null,"責任","人に対する責任","同僚や部下の育成や管理、人事評価、勤務シフトの作成や調整等に関する責任"]
[null,null,"物に対する責任","顧客情報の管理や秘密保持、土地や建物・備品等の維持・管理、顧客に提供する商品やサービスの創造・品質の維持・管理に関する責任"]
[null,null,"財務責任","利益目標の実現に対する影響、職務上取り扱う金銭や金権等の取り扱い範囲・頻度・金額、予算計画の作成や予算の執行など、金銭に関する責任"]
{"$rows_left_out":20}